En İyi Videolar
En Çok Arananlar
Son Görüntülenenler
Ruh Halleri ve Türler
Autumn
Chill
Commute
Energize
Feel good
Focus
Gaming
Party
Romance
Sad
Sleep
Summer
Winter
Workout
African
Arabic
Blues
Bollywood & Indian
Classical
Country & Americana
Dance & electronic
Decades
Family
Folk & acoustic
German hip-hop
German pop
Hip-hop
Indie & alternative
J-Pop
Jazz
K-Pop
Latin
Mandopop & cantopop
Metal
Pop
R&B & soul
Reggae & caribbean
Rock
Schlager
Soundtracks & musicals
Hesabım
Giriş Yap
Oynatma Listelerim
İstatistiklerim
Yükle
Blog
TR
English
Español
Français
Bahasa Indonesia
Português
Türkçe
Solving the React Native Build Failed Error
1:48
|
Video işleniyor...
Yükleniyor...
İndir
Sonraki Video
Solved: React Native Build Failed | Reanimated & Gradle Lock Issue Fixed!
3:14
|
İlgili Videolar
3:18
Fix Gradle Errors in React Native | Step-by-Step Guide
3:03
Fixing Gradle build failed Error in React Native with EAS Build for Android
1:39
Solving the Build Failed Error on iOS When Rebuilding React Native Projects
3:33
[Fixed] Gradle build failed with unknown error in Expo/React Native
3:14
Solved: React Native Build Failed | Reanimated & Gradle Lock Issue Fixed!
2:55
Fixing React Native iOS Build Error: node: No such file or directory in PhaseScriptExecution
2:05
Solving the BUILD FAILED Issue in React Native When Integrating Firebase for iOS Apps
3:47
How to Fix app:compileDebugJavaWithJavac FAILED Error in React Native Project?
4:49
React Native 0.83.1 New Project Not Running? 🔥 Fix in 5 Minutes (NDK Issue)
3:23
Error Resolving Plugin - id: 'com.facebook.react.settings | React Native CLI Gradle Build Failed
3:51
How to Fix EAS Build Failed for Task expo splash screen
2:53
react-native-svg Build Issue in React Native 0.78: How to Fix the C+ + Build System Error
3:40
Support React Native Android 16KB Page Size | Fix Build Failed Error | NDK
2:40
Fixing react-native-gesture-handler Build Errors in React Native Android Projects
1:43
Resolving the react-native-screens:compileDebugKotlin FAILED Error in Your React Navigation Project
2:47
STOP Wasting Time on Gradle Errors in React Native! | 100% Resolved Gradle issue in React Native
1:29
How to Fix 'Execution Failed for Task:app:checkDebugAarMetadata' in React Native Project?
1:28
Solving expo build failed for task ':app:bundleReleaseJsAndAssets' in Your React Native App
4:11
How to resolve Gradle Issues in React Native 100% working | React Native Gradle Issue | React